WiFi USB adaptér Asus 167g v Backtrack 5

Obecně. Konfigurace běžných věcí a aplikací, připojení, ladění počítačové sítě, hardware, příslušenství, nářadí, topologie, antény, pigtaily, konektory..
Uživatelský avatar
pswoboda
Level 1
Příspěvky: 22
Registrován: 08 pro 2011, 14:55

08 pro 2011, 15:07

Zdravim, mám WiFi USB adaptér Asus 167g a nedaří se mi nahrát ovladače v Backtrack 5. Poradí prosím někdo, jak tento adapter v ubuntu rozchodit?

Uživatelský avatar
pswoboda
Level 1
Příspěvky: 22
Registrován: 08 pro 2011, 14:55

09 pro 2011, 15:03

Mám stažených 6 ovladačů od verze 1.o.O - 3.O.3, ale při každém spuštění sudo make mi to vypíše hlášku: rt73.ko failed to build!
make: *** [module] Error 1

u jednoho z ovladačů se instalace rozběhne. ale samy error:

rtmp_main.c:295: error: expected ‘;’ before ‘Now’
rtmp_main.c:297: error: ‘struct _RTMP_ADAPTER’ has no member named ‘CmdQ’
rtmp_main.c:300: warning: implicit declaration of function ‘spin_lock_irqsave’
rtmp_main.c:300: error: ‘struct _RTMP_ADAPTER’ has no member named ‘CmdQLock’
rtmp_main.c:300: error: ‘IrqFlags’ undeclared (first use in this function)
rtmp_main.c:301: error: ‘struct _RTMP_ADAPTER’ has no member named ‘CmdQ’
rtmp_main.c:302: warning: implicit declaration of function ‘spin_unlock_irqrestore’
rtmp_main.c:302: error: ‘struct _RTMP_ADAPTER’ has no member named ‘CmdQLock’
rtmp_main.c:305: error: ‘pData’ undeclared (first use in this function)
rtmp_main.c:305: error: ‘struct _CmdQElmt’ has no member named ‘buffer’
rtmp_main.c:308: error: ‘struct _CmdQElmt’ has no member named ‘command’
rtmp_main.c:312: error: expected ‘;’ before ‘data’
rtmp_main.c:314: error: ‘data’ undeclared (first use in this function)
rtmp_main.c:314: error: too many arguments to function ‘RTUSBReadMACRegister’
rtmp_main.c:317: error: ‘struct _RTMP_ADAPTER’ has no member named ‘PortCfg’
rtmp_main.c:321: error: ‘struct _RTMP_ADAPTER’ has no member named ‘PortCfg’
rtmp_main.c:323: error: ‘struct _RTMP_ADAPTER’ has no member named ‘PortCfg’
rtmp_main.c:323: error: ‘struct _RTMP_ADAPTER’ has no member named ‘PortCfg’
rtmp_main.c:323: error: ‘struct _RTMP_ADAPTER’ has no member named ‘PortCfg’
rtmp_main.c:325: error: ‘struct _RTMP_ADAPTER’ has no member named ‘PortCfg’
rtmp_main.c:325: error: ‘struct _RTMP_ADAPTER’ has no member named ‘PortCfg’
rtmp_main.c:325: error: ‘struct _RTMP_ADAPTER’ has no member named ‘PortCfg’
rtmp_main.c:326: error: ‘struct _RTMP_ADAPTER’ has no member named ‘PortCfg’
rtmp_main.c:330: error: ‘struct _RTMP_ADAPTER’ has no member named ‘ExtraInfo’
rtmp_main.c:336: error: ‘struct _RTMP_ADAPTER’ has no member named ‘ExtraInfo’
rtmp_main.c:348: error: ‘struct _RTMP_ADAPTER’ has no member named ‘Mlme’
rtmp_main.c:350: warning: implicit declaration of function ‘MlmeEnqueue’
rtmp_main.c:358: error: ‘Now’ undeclared (first use in this function)
rtmp_main.c:358: error: ‘jiffies’ undeclared (first use in this function)
rtmp_main.c:359: error: ‘struct _RTMP_ADAPTER’ has no member named ‘MlmeAux’
rtmp_main.c:361: error: ‘struct _RTMP_ADAPTER’ has no member named ‘PortCfg’
rtmp_main.c:362: error: ‘struct _RTMP_ADAPTER’ has no member named ‘PortCfg’
rtmp_main.c:368: error: ‘struct _RTMP_ADAPTER’ has no member named ‘MLMEThr_pid’
rtmp_main.c:368: warning: implicit declaration of function ‘up’
rtmp_main.c:375: error: ‘struct _RTMP_ADAPTER’ has no member named ‘Mlme’
rtmp_main.c:385: error: ‘struct _RTMP_ADAPTER’ has no member named ‘MlmeAux’
rtmp_main.c:388: error: ‘struct _RTMP_ADAPTER’ has no member named ‘PortCfg’
rtmp_main.c:393: error: ‘struct _CmdQElmt’ has no member named ‘bufferlength’
rtmp_main.c:394: error: ‘struct _CmdQElmt’ has no member named ‘buffer’
rtmp_main.c:395: error: ‘struct _RTMP_ADAPTER’ has no member named ‘MLMEThr_pid’
rtmp_main.c:401: error: ‘struct _RTMP_ADAPTER’ has no member named ‘Mlme’
rtmp_main.c:411: error: ‘struct _RTMP_ADAPTER’ has no member named ‘MlmeAux’
rtmp_main.c:414: error: ‘struct _RTMP_ADAPTER’ has no member named ‘PortCfg’
rtmp_main.c:415: error: ‘struct _RTMP_ADAPTER’ has no member named ‘bConfigChanged’
rtmp_main.c:420: error: ‘struct _CmdQElmt’ has no member named ‘bufferlength’
rtmp_main.c:422: error: ‘struct _RTMP_ADAPTER’ has no member named ‘MLMEThr_pid’
rtmp_main.c:428: error: ‘struct _RTMP_ADAPTER’ has no member named ‘Mlme’
rtmp_main.c:439: error: ‘struct _RTMP_ADAPTER’ has no member named ‘MlmeAux’
rtmp_main.c:446: error: ‘struct _RTMP_ADAPTER’ has no member named ‘MLMEThr_pid’
rtmp_main.c:453: error: ‘NDIS_802_11_ANTENNA’ undeclared (first use in this function)
rtmp_main.c:453: error: expected ‘;’ before ‘Antenna’
rtmp_main.c:455: error: ‘Antenna’ undeclared (first use in this function)
rtmp_main.c:456: error: ‘struct _RTMP_ADAPTER’ has no member named ‘Antenna’
rtmp_main.c:458: error: ‘struct _RTMP_ADAPTER’ has no member named ‘Antenna’
rtmp_main.c:460: error: ‘struct _RTMP_ADAPTER’ has no member named ‘Antenna’
rtmp_main.c:462: error: ‘struct _RTMP_ADAPTER’ has no member named ‘PortCfg’
rtmp_main.c:463: error: ‘struct _RTMP_ADAPTER’ has no member named ‘LatchRfRegs’
rtmp_main.c:463: error: too many arguments to function ‘AsicAntennaSelect’
rtmp_main.c:470: error: expected ‘;’ before ‘Antenna’
rtmp_main.c:473: error: ‘struct _RTMP_ADAPTER’ has no member named ‘Antenna’
rtmp_main.c:475: error: ‘struct _RTMP_ADAPTER’ has no member named ‘Antenna’
rtmp_main.c:477: error: ‘struct _RTMP_ADAPTER’ has no member named ‘Antenna’
rtmp_main.c:479: error: ‘struct _RTMP_ADAPTER’ has no member named ‘PortCfg’
rtmp_main.c:480: error: ‘struct _RTMP_ADAPTER’ has no member named ‘LatchRfRegs’
rtmp_main.c:480: error: too many arguments to function ‘AsicAntennaSelect’
rtmp_main.c:495: error: ‘u16’ undeclared (first use in this function)
rtmp_main.c:495: error: expected ‘;’ before ‘Offset’
rtmp_main.c:496: error: expected ‘;’ before ‘Length’
rtmp_main.c:497: error: ‘Offset’ undeclared (first use in this function)
rtmp_main.c:497: error: ‘Length’ undeclared (first use in this function)
rtmp_main.c:497: error: too many arguments to function ‘RTUSBMultiRead’
rtmp_main.c:503: error: expected ‘;’ before ‘Offset’
rtmp_main.c:504: error: expected ‘;’ before ‘Length’
rtmp_main.c:505: error: too many arguments to function ‘RTUSBMultiWrite’
rtmp_main.c:511: error: expected ‘;’ before ‘Offset’
rtmp_main.c:512: error: expected ‘;’ before ‘Length’
rtmp_main.c:513: error: too many arguments to function ‘RTUSBReadEEPROM’
rtmp_main.c:519: error: expected ‘;’ before ‘Offset’
rtmp_main.c:524: error: expected ‘;’ before ‘Residual’
rtmp_main.c:526: error: ‘Residual’ undeclared (first use in this function)
rtmp_main.c:528: error: too many arguments to function ‘RTUSBWriteEEPROM’
rtmp_main.c:533: error: too many arguments to function ‘RTUSBWriteEEPROM’
rtmp_main.c:541: error: ‘USB_DIR_OUT’ undeclared (first use in this function)
rtmp_main.c:541: error: ‘USB_TYPE_VENDOR’ undeclared (first use in this function)
rtmp_main.c:541: error: ‘USB_RECIP_DEVICE’ undeclared (first use in this function)
rtmp_main.c:546: error: too many arguments to function ‘RTUSB_VendorRequest’
rtmp_main.c:557: error: too many arguments to function ‘RTUSB_VendorRequest’
rtmp_main.c:565: error: ‘struct _RTMP_ADAPTER’ has no member named ‘Flags’
rtmp_main.c:572: error: too many arguments to function ‘ReleaseAdapter’
rtmp_main.c:575: error: ‘struct _RTMP_ADAPTER’ has no member named ‘Flags’
rtmp_main.c:577: error: ‘struct _RTMP_ADAPTER’ has no member named ‘Flags’
rtmp_main.c:579: error: ‘struct _RTMP_ADAPTER’ has no member named ‘Flags’
rtmp_main.c:582: error: ‘struct _RTMP_ADAPTER’ has no member named ‘Flags’
rtmp_main.c:586: error: ‘struct _RTMP_ADAPTER’ has no member named ‘SendTxWaitQueue’
rtmp_main.c:588: error: too many arguments to function ‘RTMPDeQueuePacket’
rtmp_main.c:602: error: ‘struct _RTMP_ADAPTER’ has no member named ‘Flags’
rtmp_main.c:607: error: ‘struct _RTMP_ADAPTER’ has no member named ‘RxContext’
rtmp_main.c:609: error: ‘struct _RX_CONTEXT’ has no member named ‘pUrb’
rtmp_main.c:611: warning: implicit declaration of function ‘usb_kill_urb’
rtmp_main.c:611: error: ‘struct _RX_CONTEXT’ has no member named ‘pUrb’
rtmp_main.c:612: warning: implicit declaration of function ‘usb_free_urb’
rtmp_main.c:612: error: ‘struct _RX_CONTEXT’ has no member named ‘pUrb’
rtmp_main.c:613: error: ‘struct _RX_CONTEXT’ has no member named ‘pUrb’
rtmp_main.c:615: error: ‘struct _RX_CONTEXT’ has no member named ‘TransferBuffer’
rtmp_main.c:617: warning: implicit declaration of function ‘kfree’
rtmp_main.c:617: error: ‘struct _RX_CONTEXT’ has no member named ‘TransferBuffer’
rtmp_main.c:618: error: ‘struct _RX_CONTEXT’ has no member named ‘TransferBuffer’
rtmp_main.c:622: error: ‘struct _RTMP_ADAPTER’ has no member named ‘Flags’
rtmp_main.c:623: error: ‘struct _RTMP_ADAPTER’ has no member named ‘Flags’
rtmp_main.c:625: error: ‘struct _RTMP_ADAPTER’ has no member named ‘Flags’
rtmp_main.c:628: error: ‘struct _RTMP_ADAPTER’ has no member named ‘Flags’
rtmp_main.c:631: error: too many arguments to function ‘RTUSBWriteMACRegister’
rtmp_main.c:639: error: ‘RT_802_11_STA_CONFIG’ has no member named ‘EnableTxBurst’
rtmp_main.c:639: error: ‘struct _RTMP_ADAPTER’ has no member named ‘PortCfg’
rtmp_main.c:641: error: ‘struct _RTMP_ADAPTER’ has no member named ‘PortCfg’
rtmp_main.c:641: error: ‘RT_802_11_STA_CONFIG’ has no member named ‘EnableTxBurst’
rtmp_main.c:643: error: ‘struct _RTMP_ADAPTER’ has no member named ‘PortCfg’
rtmp_main.c:645: error: ‘struct _RTMP_ADAPTER’ has no member named ‘PortCfg’
rtmp_main.c:648: error: ‘struct _RTMP_ADAPTER’ has no member named ‘PortCfg’
rtmp_main.c:657: error: ‘struct _RTMP_ADAPTER’ has no member named ‘PortCfg’
rtmp_main.c:658: error: ‘u8’ undeclared (first use in this function)
rtmp_main.c:658: error: expected ‘)’ before ‘pAd’
rtmp_main.c:658: error: too many arguments to function ‘AsicSetSlotTime’
rtmp_main.c:664: error: ‘struct _RTMP_ADAPTER’ has no member named ‘PortCfg’
rtmp_main.c:664: error: ‘RT_802_11_STA_CONFIG’ has no member named ‘UseBGProtection’
rtmp_main.c:666: error: ‘struct _RTMP_ADAPTER’ has no member named ‘PortCfg’
rtmp_main.c:667: error: ‘struct _RTMP_ADAPTER’ has no member named ‘PortCfg’
rtmp_main.c:667: error: ‘RT_802_11_STA_CONFIG’ has no member named ‘AdhocMode’
rtmp_main.c:671: error: ‘struct _RTMP_ADAPTER’ has no member named ‘PortCfg’
rtmp_main.c:671: error: ‘RT_802_11_STA_CONFIG’ has no member named ‘AdhocMode’
rtmp_main.c:672: error: ‘struct _RTMP_ADAPTER’ has no member named ‘PortCfg’
rtmp_main.c:674: error: too many arguments to function ‘MlmeUpdateTxRates’
rtmp_main.c:675: warning: implicit declaration of function ‘MakeIbssBeacon’
rtmp_main.c:689: error: too many arguments to function ‘MlmeSetPsmBit’
rtmp_main.c:690: error: ‘struct _RTMP_ADAPTER’ has no member named ‘PortCfg’
rtmp_main.c:690: error: too many arguments to function ‘RTMPSendNullFrame’
rtmp_main.c:694: error: ‘struct _RTMP_ADAPTER’ has no member named ‘PortCfg’
rtmp_main.c:698: error: ‘struct _RTMP_ADAPTER’ has no member named ‘ExtraInfo’
rtmp_main.c:704: error: ‘struct _RTMP_ADAPTER’ has no member named ‘ExtraInfo’
rtmp_main.c:711: error: expected ‘;’ before ‘i’
rtmp_main.c:715: error: too many arguments to function ‘MlmeSuspend’
rtmp_main.c:719: error: too many arguments to function ‘RTUSBWriteMACRegister’
rtmp_main.c:721: warning: implicit declaration of function ‘atomic_read’
rtmp_main.c:721: error: ‘struct _RTMP_ADAPTER’ has no member named ‘PendingRx’
rtmp_main.c:722: error: ‘struct _RTMP_ADAPTER’ has no member named ‘BulkOutPending’
rtmp_main.c:723: error: ‘struct _RTMP_ADAPTER’ has no member named ‘BulkOutPending’
rtmp_main.c:724: error: ‘struct _RTMP_ADAPTER’ has no member named ‘BulkOutPending’
rtmp_main.c:725: error: ‘struct _RTMP_ADAPTER’ has no member named ‘BulkOutPending’
rtmp_main.c:728: error: ‘struct _RTMP_ADAPTER’ has no member named ‘PendingRx’
rtmp_main.c:738: error: too many arguments to function ‘RTUSB_VendorRequest’
rtmp_main.c:741: error: ‘struct _RTMP_ADAPTER’ has no member named ‘BulkOutPending’
rtmp_main.c:742: error: ‘struct _RTMP_ADAPTER’ has no member named ‘BulkOutPending’
rtmp_main.c:743: error: ‘struct _RTMP_ADAPTER’ has no member named ‘BulkOutPending’
rtmp_main.c:744: error: ‘struct _RTMP_ADAPTER’ has no member named ‘BulkOutPending’
rtmp_main.c:747: error: ‘i’ undeclared (first use in this function)
rtmp_main.c:758: error: ‘struct _RTMP_ADAPTER’ has no member named ‘Flags’
rtmp_main.c:760: error: ‘struct _RTMP_ADAPTER’ has no member named ‘Flags’
rtmp_main.c:762: error: ‘struct _RTMP_ADAPTER’ has no member named ‘Flags’
rtmp_main.c:764: error: ‘struct _RTMP_ADAPTER’ has no member named ‘Flags’
rtmp_main.c:766: error: ‘struct _RTMP_ADAPTER’ has no member named ‘Flags’
rtmp_main.c:768: error: ‘struct _RTMP_ADAPTER’ has no member named ‘Flags’
rtmp_main.c:771: error: ‘struct _RTMP_ADAPTER’ has no member named ‘Flags’
rtmp_main.c:773: error: ‘struct _RTMP_ADAPTER’ has no member named ‘Flags’
rtmp_main.c:774: error: ‘struct _RTMP_ADAPTER’ has no member named ‘Flags’
rtmp_main.c:775: error: ‘struct _RTMP_ADAPTER’ has no member named ‘Flags’
rtmp_main.c:779: error: too many arguments to function ‘RTUSBWriteMACRegister’
rtmp_main.c:786: error: too many arguments to function ‘LinkDown’
rtmp_main.c:791: error: expected ‘;’ before ‘Offset’
rtmp_main.c:792: error: expected ‘)’ before ‘pData’
rtmp_main.c:793: error: ‘Value’ undeclared (first use in this function)
rtmp_main.c:795: error: too many arguments to function ‘RTUSBWriteBBPRegister’
rtmp_main.c:801: error: expected ‘;’ before ‘Offset’
rtmp_main.c:802: error: expected ‘;’ before ‘pValue’
rtmp_main.c:805: error: ‘pValue’ undeclared (first use in this function)
rtmp_main.c:805: error: too many arguments to function ‘RTUSBReadBBPRegister’
rtmp_main.c:812: error: expected ‘;’ before ‘Value’
rtmp_main.c:815: error: too many arguments to function ‘RTUSBWriteRFRegister’
rtmp_main.c:821: error: expected ‘;’ before ‘Value’
rtmp_main.c:823: error: too many arguments to function ‘RTUSBMultiRead’
rtmp_main.c:835: error: too many arguments to function ‘RTUSB_VendorRequest’
rtmp_main.c:846: error: too many arguments to function ‘RTUSB_VendorRequest’
rtmp_main.c:867: error: expected ‘;’ before ‘Value1’
rtmp_main.c:868: error: ‘Value1’ undeclared (first use in this function)
rtmp_main.c:868: error: too many arguments to function ‘RTUSBReadMACRegister’
rtmp_main.c:869: error: ‘Value2’ undeclared (first use in this function)
rtmp_main.c:869: error: too many arguments to function ‘RTUSBReadMACRegister’
rtmp_main.c:882: error: too many arguments to function ‘RTUSBWriteMACRegister’
rtmp_main.c:883: error: too many arguments to function ‘RTUSBWriteMACRegister’
rtmp_main.c:888: error: too many arguments to function ‘MlmeUpdateTxRates’
rtmp_main.c:889: error: ‘struct _RTMP_ADAPTER’ has no member named ‘PortCfg’
rtmp_main.c:895: error: expected ‘;’ before ‘Preamble’
rtmp_main.c:896: error: ‘Preamble’ undeclared (first use in this function)
rtmp_main.c:898: error: ‘struct _RTMP_ADAPTER’ has no member named ‘PortCfg’
rtmp_main.c:899: error: too many arguments to function ‘MlmeSetTxPreamble’
rtmp_main.c:905: error: ‘struct _RTMP_ADAPTER’ has no member named ‘PortCfg’
rtmp_main.c:906: error: too many arguments to function ‘MlmeSetTxPreamble’
rtmp_main.c:915: error: ‘struct _CmdQElmt’ has no member named ‘buffer’
rtmp_main.c:917: error: too many arguments to function ‘RTMPSetPhyMode’
rtmp_main.c:919: error: too many arguments to function ‘RTMPSetPhyMode’
rtmp_main.c:921: error: too many arguments to function ‘RTMPSetPhyMode’
rtmp_main.c:930: error: expected ‘;’ before ‘phymode’
rtmp_main.c:931: error: ‘phymode’ undeclared (first use in this function)
rtmp_main.c:931: error: too many arguments to function ‘RTMPSetPhyMode’
rtmp_main.c:1022: error: expected ‘;’ before ‘KeyIdx’
rtmp_main.c:1028: error: ‘KeyIdx’ undeclared (first use in this function)
rtmp_main.c:1028: error: ‘struct _NDIS_802_11_WEP’ has no member named ‘KeyIndex’
rtmp_main.c:1031: error: ‘struct _NDIS_802_11_WEP’ has no member named ‘KeyLength’
rtmp_main.c:1031: error: ‘struct _NDIS_802_11_WEP’ has no member named ‘KeyLength’
rtmp_main.c:1038: error: expected ‘;’ before ‘CipherAlg’
rtmp_main.c:1039: error: ‘struct _RTMP_ADAPTER’ has no member named ‘SharedKey’
rtmp_main.c:1039: error: expected ‘;’ before ‘pWepKey’
rtmp_main.c:1040: error: ‘struct _RTMP_ADAPTER’ has no member named ‘SharedKey’
rtmp_main.c:1040: error: ‘struct _NDIS_802_11_WEP’ has no member named ‘KeyMaterial’
rtmp_main.c:1040: error: ‘struct _NDIS_802_11_WEP’ has no member named ‘KeyLength’
rtmp_main.c:1040: error: too many arguments to function ‘RTMPMoveMemory’
rtmp_main.c:1041: error: ‘CipherAlg’ undeclared (first use in this function)
rtmp_main.c:1041: error: ‘struct _RTMP_ADAPTER’ has no member named ‘SharedKey’
rtmp_main.c:1042: error: ‘struct _RTMP_ADAPTER’ has no member named ‘SharedKey’
rtmp_main.c:1043: error: ‘struct _NDIS_802_11_WEP’ has no member named ‘KeyIndex’
rtmp_main.c:1046: error: ‘struct _RTMP_ADAPTER’ has no member named ‘PortCfg’
rtmp_main.c:1046: error: expected ‘;’ before ‘KeyIdx’
rtmp_main.c:1048: error: expected ‘)’ before ‘KeyIdx’
rtmp_main.c:1048: error: too many arguments to function ‘AsicAddSharedKeyEntry’
rtmp_main.c:1056: error: expected ‘;’ before ‘KeyIdx’
rtmp_main.c:1059: error: ‘NDIS_802_11_KEY_INDEX’ undeclared (first use in this function)
rtmp_main.c:1059: error: expected expression before ‘)’ token
rtmp_main.c:1075: error: ‘struct _RTMP_ADAPTER’ has no member named ‘SharedKey’
rtmp_main.c:1076: error: ‘struct _RTMP_ADAPTER’ has no member named ‘SharedKey’
rtmp_main.c:1077: error: expected ‘)’ before ‘KeyIdx’
rtmp_main.c:1077: error: too many arguments to function ‘AsicRemoveSharedKeyEntry’
rtmp_main.c:1087: error: expected ‘;’ before ‘i’
rtmp_main.c:1090: error: ‘struct _NDIS_802_11_KEY’ has no member named ‘KeyIndex’
rtmp_main.c:1100: error: expected ‘;’ before ‘CipherAlg’
rtmp_main.c:1102: error: ‘struct _RTMP_ADAPTER’ has no member named ‘SharedKey’
rtmp_main.c:1102: error: expected ‘;’ before ‘pKey’
rtmp_main.c:1103: error: ‘struct _RTMP_ADAPTER’ has no member named ‘SharedKey’
rtmp_main.c:1103: error: ‘struct _NDIS_802_11_KEY’ has no member named ‘KeyMaterial’
rtmp_main.c:1103: error: ‘struct _NDIS_802_11_KEY’ has no member named ‘KeyLength’
rtmp_main.c:1103: error: too many arguments to function ‘RTMPMoveMemory’
rtmp_main.c:1105: error: ‘struct _NDIS_802_11_KEY’ has no member named ‘KeyLength’
rtmp_main.c:1113: error: ‘struct _NDIS_802_11_KEY’ has no member named ‘KeyLength’
rtmp_main.c:1115: error: ‘struct _NDIS_802_11_KEY’ has no member named ‘KeyLength’
rtmp_main.c:1117: error: ‘struct _RTMP_ADAPTER’ has no member named ‘SharedKey’
rtmp_main.c:1117: error: ‘struct _NDIS_802_11_KEY’ has no member named ‘KeyLength’
rtmp_main.c:1117: error: ‘struct _NDIS_802_11_KEY’ has no member named ‘KeyMaterial’
rtmp_main.c:1117: error: ‘struct _NDIS_802_11_KEY’ has no member named ‘KeyLength’
rtmp_main.c:1117: error: too many arguments to function ‘RTMPMoveMemory’
rtmp_main.c:1121: error: ‘struct _RTMP_ADAPTER’ has no member named ‘SharedKey’
rtmp_main.c:1121: error: ‘struct _NDIS_802_11_KEY’ has no member named ‘KeyLength’
rtmp_main.c:1121: error: ‘struct _NDIS_802_11_KEY’ has no member named ‘KeyMaterial’
rtmp_main.c:1121: error: ‘struct _NDIS_802_11_KEY’ has no member named ‘KeyLength’
rtmp_main.c:1121: error: too many arguments to function ‘RTMPMoveMemory’
rtmp_main.c:1126: error: ‘struct _RTMP_ADAPTER’ has no member named ‘SharedKey’
rtmp_main.c:1127: error: ‘struct _NDIS_802_11_KEY’ has no member named ‘KeyIndex’
rtmp_main.c:1130: error: ‘struct _RTMP_ADAPTER’ has no member named ‘PortCfg’
rtmp_main.c:1130: error: expected ‘;’ before ‘KeyIdx’
rtmp_main.c:1133: error: expected ‘)’ before ‘KeyIdx’
rtmp_main.c:1133: error: too many arguments to function ‘AsicAddSharedKeyEntry’
rtmp_main.c:1221: error: expected ‘;’ before ‘KeyIdx’
rtmp_main.c:1224: error: ‘struct _RTMP_ADAPTER’ has no member named ‘PortCfg’
rtmp_main.c:1231: error: ‘struct _NDIS_802_11_REMOVE_KEY’ has no member named ‘KeyIndex’
rtmp_main.c:1249: error: ‘struct _RTMP_ADAPTER’ has no member named ‘SharedKey’
rtmp_main.c:1250: error: ‘struct _RTMP_ADAPTER’ has no member named ‘SharedKey’
rtmp_main.c:1251: error: expected ‘)’ before ‘KeyIdx’
rtmp_main.c:1251: error: too many arguments to function ‘AsicRemoveSharedKeyEntry’
rtmp_main.c:1269: error: too many arguments to function ‘MlmeSetPsmBit’
rtmp_main.c:1271: error: ‘struct _RTMP_ADAPTER’ has no member named ‘PortCfg’
rtmp_main.c:1272: error: ‘struct _RTMP_ADAPTER’ has no member named ‘PortCfg’
rtmp_main.c:1273: error: ‘struct _RTMP_ADAPTER’ has no member named ‘PortCfg’
rtmp_main.c:1274: error: ‘struct _RTMP_ADAPTER’ has no member named ‘PortCfg’
rtmp_main.c:1281: error: ‘struct _RTMP_ADAPTER’ has no member named ‘PortCfg’
rtmp_main.c:1282: error: ‘struct _RTMP_ADAPTER’ has no member named ‘PortCfg’
rtmp_main.c:1283: error: ‘struct _RTMP_ADAPTER’ has no member named ‘PortCfg’
rtmp_main.c:1284: error: ‘struct _RTMP_ADAPTER’ has no member named ‘PortCfg’
rtmp_main.c:1285: error: ‘struct _RTMP_ADAPTER’ has no member named ‘PortCfg’
rtmp_main.c:1292: error: ‘struct _RTMP_ADAPTER’ has no member named ‘PortCfg’
rtmp_main.c:1293: error: ‘struct _RTMP_ADAPTER’ has no member named ‘PortCfg’
rtmp_main.c:1294: error: ‘struct _RTMP_ADAPTER’ has no member named ‘PortCfg’
rtmp_main.c:1295: error: ‘struct _RTMP_ADAPTER’ has no member named ‘PortCfg’
rtmp_main.c:1296: error: ‘struct _RTMP_ADAPTER’ has no member named ‘PortCfg’
rtmp_main.c:1310: error: too many arguments to function ‘MlmeSetPsmBit’
rtmp_main.c:1318: error: ‘struct _CmdQElmt’ has no member named ‘CmdFromNdis’
rtmp_main.c:1320: error: ‘struct _CmdQElmt’ has no member named ‘command’
rtmp_main.c:1321: error: ‘struct _CmdQElmt’ has no member named ‘command’
rtmp_main.c:1322: error: ‘struct _CmdQElmt’ has no member named ‘command’
rtmp_main.c:1323: error: ‘struct _CmdQElmt’ has no member named ‘command’
rtmp_main.c:1327: error: ‘struct _CmdQElmt’ has no member named ‘command’
rtmp_main.c:1328: error: ‘struct _CmdQElmt’ has no member named ‘command’
rtmp_main.c:1332: error: ‘struct _CmdQElmt’ has no member named ‘command’
rtmp_main.c:1334: error: ‘struct _CmdQElmt’ has no member named ‘buffer’
rtmp_main.c:1335: error: ‘struct _CmdQElmt’ has no member named ‘buffer’
rtmp_main.c:1341: error: ‘struct _CmdQElmt’ has no member named ‘InUse’
rtmp_main.c: In function ‘usb_rtusb_open’:
rtmp_main.c:1350: error: dereferencing pointer to incomplete type
rtmp_main.c:1352: error: ‘u8’ undeclared (first use in this function)
rtmp_main.c:1352: error: expected ‘;’ before ‘TmpPhy’
rtmp_main.c:1354: warning: implicit declaration of function ‘printk’
rtmp_main.c:1356: warning: implicit declaration of function ‘init_MUTEX’
rtmp_main.c:1359: error: ‘struct _RTMP_ADAPTER’ has no member named ‘PortCfg’
rtmp_main.c:1395: error: ‘u32’ undeclared (first use in this function)
rtmp_main.c:1395: error: expected ‘;’ before ‘MacCsr0’
rtmp_main.c:1399: error: ‘MacCsr0’ undeclared (first use in this function)
rtmp_main.c:1399: error: too many arguments to function ‘RTUSBReadMACRegister’
rtmp_main.c:1405: error: ‘Index’ undeclared (first use in this function)
rtmp_main.c:1435: error: ‘struct _RTMP_ADAPTER’ has no member named ‘NicConfig2’
rtmp_main.c:1437: error: ‘struct _RTMP_ADAPTER’ has no member named ‘BbpTuning’
rtmp_main.c:1438: error: ‘struct _RTMP_ADAPTER’ has no member named ‘BbpTuning’
rtmp_main.c:1439: error: ‘struct _RTMP_ADAPTER’ has no member named ‘BbpTuning’
rtmp_main.c:1440: error: ‘struct _RTMP_ADAPTER’ has no member named ‘BbpTuning’
rtmp_main.c:1445: error: ‘TmpPhy’ undeclared (first use in this function)
rtmp_main.c:1445: error: ‘struct _RTMP_ADAPTER’ has no member named ‘PortCfg’
rtmp_main.c:1446: error: ‘struct _RTMP_ADAPTER’ has no member named ‘PortCfg’
rtmp_main.c:1447: error: too many arguments to function ‘RTMPSetPhyMode’
rtmp_main.c:1465: error: dereferencing pointer to incomplete type
rtmp_main.c:1465: error: ‘struct _RTMP_ADAPTER’ has no member named ‘CurrentAddress’
rtmp_main.c:1465: error: dereferencing pointer to incomplete type
rtmp_main.c:1469: error: ‘struct _RTMP_ADAPTER’ has no member named ‘Flags’
rtmp_main.c:1472: error: ‘struct _RTMP_ADAPTER’ has no member named ‘Flags’
rtmp_main.c:1475: error: too many arguments to function ‘RTUSBWriteMACRegister’
rtmp_main.c:1477: error: ‘struct _RTMP_ADAPTER’ has no member named ‘PortCfg’
rtmp_main.c:1477: error: too many arguments to function ‘AsicSwitchChannel’
rtmp_main.c:1478: error: ‘struct _RTMP_ADAPTER’ has no member named ‘PortCfg’
rtmp_main.c:1478: error: too many arguments to function ‘AsicLockChannel’
rtmp_main.c:1483: error: ‘struct _RTMP_ADAPTER’ has no member named ‘VendorDesc’
rtmp_main.c:1486: warning: implicit declaration of function ‘netif_start_queue’
rtmp_main.c:1488: warning: implicit declaration of function ‘netif_carrier_on’
rtmp_main.c:1489: warning: implicit declaration of function ‘netif_wake_queue’
rtmp_main.c:1494: error: too many arguments to function ‘ReleaseAdapter’
rtmp_main.c: In function ‘usb_rtusb_close’:
rtmp_main.c:1827: error: dereferencing pointer to incomplete type
rtmp_main.c:1831: warning: implicit declaration of function ‘DECLARE_WAIT_QUEUE_HEAD’
rtmp_main.c:1831: error: ‘unlink_wakeup’ undeclared (first use in this function)
rtmp_main.c:1832: warning: implicit declaration of function ‘DECLARE_WAITQUEUE’
rtmp_main.c:1832: error: ‘wait’ undeclared (first use in this function)
rtmp_main.c:1832: error: ‘current’ undeclared (first use in this function)
rtmp_main.c:1836: warning: implicit declaration of function ‘netif_carrier_off’
rtmp_main.c:1837: warning: implicit declaration of function ‘netif_stop_queue’
rtmp_main.c:1840: warning: implicit declaration of function ‘add_wait_queue’
rtmp_main.c:1841: error: ‘struct _RTMP_ADAPTER’ has no member named ‘wait’
rtmp_main.c:1844: error: ‘struct _RTMP_ADAPTER’ has no member named ‘PendingRx’
rtmp_main.c:1847: warning: implicit declaration of function ‘msleep’
rtmp_main.c:1851: error: ‘struct _RTMP_ADAPTER’ has no member named ‘wait’
rtmp_main.c:1852: warning: implicit declaration of function ‘remove_wait_queue’
rtmp_main.c:1854: error: ‘struct _RTMP_ADAPTER’ has no member named ‘MLMEThr_pid’
rtmp_main.c:1857: error: ‘struct _RTMP_ADAPTER’ has no member named ‘MLMEThr_pid’
rtmp_main.c:1858: warning: implicit declaration of function ‘wmb’
rtmp_main.c:1859: warning: implicit declaration of function ‘kill_proc’
rtmp_main.c:1859: error: ‘struct _RTMP_ADAPTER’ has no member named ‘MLMEThr_pid’
rtmp_main.c:1859: error: ‘SIGTERM’ undeclared (first use in this function)
rtmp_main.c:1862: error: ‘KERN_ERR’ undeclared (first use in this function)
rtmp_main.c:1862: error: expected ‘)’ before string constant
rtmp_main.c:1865: warning: implicit declaration of function ‘wait_for_completion’
rtmp_main.c:1867: error: ‘struct _RTMP_ADAPTER’ has no member named ‘RTUSBCmdThr_pid’
rtmp_main.c:1870: error: ‘struct _RTMP_ADAPTER’ has no member named ‘RTUSBCmdThr_pid’
rtmp_main.c:1872: error: ‘struct _RTMP_ADAPTER’ has no member named ‘RTUSBCmdThr_pid’
rtmp_main.c:1875: error: expected ‘)’ before string constant
rtmp_main.c:1880: error: too many arguments to function ‘RTUSBHalt’
rtmp_main.c: In function ‘MlmeThread’:
rtmp_main.c:1892: warning: implicit declaration of function ‘daemonize’
rtmp_main.c:1893: warning: implicit declaration of function ‘allow_signal’
rtmp_main.c:1893: error: ‘SIGTERM’ undeclared (first use in this function)
rtmp_main.c:1894: error: ‘current’ undeclared (first use in this function)
rtmp_main.c:1896: warning: implicit declaration of function ‘complete’
rtmp_main.c:1904: warning: implicit declaration of function ‘down’
rtmp_main.c:1957: warning: implicit declaration of function ‘complete_and_exit’
rtmp_main.c: In function ‘RTUSBCmdThread’:
rtmp_main.c:1968: error: ‘SIGTERM’ undeclared (first use in this function)
rtmp_main.c:1969: error: ‘current’ undeclared (first use in this function)
rtmp_main.c: At top level:
rtmp_main.c:2017: warning: ‘struct usb_interface’ declared inside parameter list
rtmp_main.c:2016: error: conflicting types for ‘usb_rtusb_probe’
rtmp_main.c:99: note: previous declaration of ‘usb_rtusb_probe’ was here
rtmp_main.c: In function ‘usb_rtusb_probe’:
rtmp_main.c:2019: warning: implicit declaration of function ‘interface_to_usbdev’
rtmp_main.c:2019: warning: initialization makes pointer from integer without a cast
rtmp_main.c:2026: warning: implicit declaration of function ‘usb_get_dev’
rtmp_main.c:2029: error: dereferencing pointer to incomplete type
rtmp_main.c:2030: error: dereferencing pointer to incomplete type
rtmp_main.c:2032: error: dereferencing pointer to incomplete type
rtmp_main.c:2032: error: dereferencing pointer to incomplete type
rtmp_main.c:2041: warning: implicit declaration of function ‘alloc_etherdev’
rtmp_main.c:2041: warning: assignment makes pointer from integer without a cast
rtmp_main.c:2046: warning: implicit declaration of function ‘module_put’
rtmp_main.c:2046: error: ‘THIS_MODULE’ undeclared (first use in this function)
rtmp_main.c:2050: error: dereferencing pointer to incomplete type
rtmp_main.c:2053: error: dereferencing pointer to incomplete type
rtmp_main.c:2055: warning: implicit declaration of function ‘SET_MODULE_OWNER’
rtmp_main.c:2056: warning: implicit declaration of function ‘ether_setup’
rtmp_main.c:2058: error: dereferencing pointer to incomplete type
rtmp_main.c:2059: error: dereferencing pointer to incomplete type
rtmp_main.c:2060: error: dereferencing pointer to incomplete type
rtmp_main.c:2061: error: dereferencing pointer to incomplete type
rtmp_main.c:2062: error: dereferencing pointer to incomplete type
rtmp_main.c:2065: error: dereferencing pointer to incomplete type
rtmp_main.c:2066: error: dereferencing pointer to incomplete type
rtmp_main.c:2068: error: dereferencing pointer to incomplete type
rtmp_main.c:2070: error: dereferencing pointer to incomplete type
rtmp_main.c:2071: error: dereferencing pointer to incomplete type
rtmp_main.c:2072: error: dereferencing pointer to incomplete type
rtmp_main.c:2073: error: dereferencing pointer to incomplete type
rtmp_main.c:2075: error: ‘struct _RTMP_ADAPTER’ has no member named ‘PortCfg’
rtmp_main.c:2077: error: ‘struct _RTMP_ADAPTER’ has no member named ‘MLMEThr_pid’
rtmp_main.c:2078: error: ‘struct _RTMP_ADAPTER’ has no member named ‘RTUSBCmdThr_pid’
rtmp_main.c:2080: warning: implicit declaration of function ‘SET_NETDEV_DEV’
rtmp_main.c:2080: error: dereferencing pointer to incomplete type
rtmp_main.c:2092: warning: implicit declaration of function ‘sprintf’
rtmp_main.c:2092: warning: incompatible implicit declaration of built-in function ‘sprintf’
rtmp_main.c:2095: warning: implicit declaration of function ‘dev_get_by_name’
rtmp_main.c:2095: warning: comparison between pointer and integer
rtmp_main.c:2117: warning: incompatible implicit declaration of built-in function ‘sprintf’
rtmp_main.c:2117: error: dereferencing pointer to incomplete type
rtmp_main.c:2122: error: dereferencing pointer to incomplete type
rtmp_main.c:2125: error: dereferencing pointer to incomplete type
rtmp_main.c:2128: error: ‘struct _RTMP_ADAPTER’ has no member named ‘BulkOutMaxPacketSize’
rtmp_main.c:2128: error: ‘u16’ undeclared (first use in this function)
rtmp_main.c:2128: error: expected ‘;’ before ‘endpoint’
rtmp_main.c:2085: warning: unused variable ‘device’
rtmp_main.c:2138: warning: implicit declaration of function ‘register_netdev’
rtmp_main.c:2142: warning: implicit declaration of function ‘usb_set_intfdata’
rtmp_main.c:2148: warning: implicit declaration of function ‘free_netdev’
rtmp_main.c: At top level:
rtmp_main.c:2153: warning: ‘struct usb_interface’ declared inside parameter list
rtmp_main.c:2153: error: conflicting types for ‘usb_rtusb_disconnect’
rtmp_main.c:102: note: previous declaration of ‘usb_rtusb_disconnect’ was here
rtmp_main.c: In function ‘usb_rtusb_disconnect’:
rtmp_main.c:2155: warning: initialization makes pointer from integer without a cast
rtmp_main.c:2158: warning: implicit declaration of function ‘usb_get_intfdata’
rtmp_main.c:2158: warning: assignment makes pointer from integer without a cast
rtmp_main.c:2161: error: ‘struct _RTMP_ADAPTER’ has no member named ‘Flags’
rtmp_main.c:2167: warning: implicit declaration of function ‘tasklet_kill’
rtmp_main.c:2169: warning: implicit declaration of function ‘udelay’
rtmp_main.c:2176: warning: implicit declaration of function ‘unregister_netdev’
rtmp_main.c:2179: warning: implicit declaration of function ‘flush_scheduled_work’
rtmp_main.c:2183: warning: implicit declaration of function ‘usb_put_dev’
rtmp_main.c: At top level:
rtmp_main.c:2194: error: expected ‘=’, ‘,’, ‘;’, ‘asm’ or ‘__attribute__’ before ‘usb_rtusb_init’
rtmp_main.c:2204: error: expected ‘=’, ‘,’, ‘;’, ‘asm’ or ‘__attribute__’ before ‘usb_rtusb_exit’
rtmp_main.c:2213: warning: data definition has no type or storage class
rtmp_main.c:2213: warning: type defaults to ‘int’ in declaration of ‘module_init’
rtmp_main.c:2213: warning: parameter names (without types) in function declaration
rtmp_main.c:2214: warning: data definition has no type or storage class
rtmp_main.c:2214: warning: type defaults to ‘int’ in declaration of ‘module_exit’
rtmp_main.c:2214: warning: parameter names (without types) in function declaration
make: *** [rtmp_main.o] Error 1
root@bt:/media/A4182C14182BE3D0/7/RT73_Linux_STA_Drv1.0.3.6/Module#

Uživatelský avatar
android
Level 7
Příspěvky: 461
Registrován: 10 říj 2008, 22:48

10 pro 2011, 08:59

Máš naprostou jistotu, že ovládač pro Asus 167g v BackTrack 5 nebyl funkční - tedy do doby než konfigurák přepsal ten zajímavý pokus ..?

Uživatelský avatar
pswoboda
Level 1
Příspěvky: 22
Registrován: 08 pro 2011, 14:55

10 pro 2011, 09:27

...a můžeš poradit, co se s tím dá ještě dělat? O žádný pokus jsem se nepokoušel, v Linuxu nejsem vůbec zběhlý.

Uživatelský avatar
cocaine
Level 7
Příspěvky: 398
Registrován: 29 dub 2008, 23:54
Bydliště: Země Oz

10 pro 2011, 09:59

Pokud neumíš ovládat operační systém jakou radu čekáš?
http://forum.airdump.cz/viewtopic.php?id=237
Pokud něco funguje již v roce 2010 a ty to nejsi schopen ani najít ve vyhledávači a funkční ovládač přeinstaluješ ovládačem co nefunguje pak opravdu netuším..
Jednou deset minut a ušetříš hodiny

Uživatelský avatar
pswoboda
Level 1
Příspěvky: 22
Registrován: 08 pro 2011, 14:55

10 pro 2011, 10:55

Děkuji, já už jsem se k tomuto postupu prohledal, ale zarazil me odkaz na stránku ovladace, který jsem chtěl stáhnout, ale ovladač je již smazany.
mkdir ~/Desktop/asus
cd ~/Desktop/asus
wget http://rt2x00.serialmonkey.com/rt73-cvs-daily.tar.gz
tar -xvzf ./rt73-cvs-daily.tar.gz
ls
cd rt-73-cvs-200xxx/Module
make
make install
modprobe rt73
ifconfig wlan0 up

Mám teď prosim znovu nainstalovat Backtrack 5 a zkusit postup výše uvedený nebo musím naistalovat Mandrivu? Děkuji

Uživatelský avatar
Stealth
Level 5
Příspěvky: 127
Registrován: 18 bře 2009, 17:40

10 pro 2011, 12:45

Nie som si celkom istý, ale zrovna ovládače od Serialmonkey verzia CVS fungovali maximalne do jadra 2.6.27. Určité vylepšenia boli od nezavislých autorov ako napr. rt73-k2wrlz-3.0.3. Tento ovládač fungoval až do jadra 2.6.31. Následne bol vývoj ukončený, vzhľadom na to, že jadro obsahuje všetky potrebné ovládače pre Ralinky okrem posledných modelov ako napr. rt5390. BT5 obsahuje ovládač aký potrebuješ. Problém môže byť s firmware, ktorý treba dohrať a umiestniť do správneho adresára.

Uživatelský avatar
pswoboda
Level 1
Příspěvky: 22
Registrován: 08 pro 2011, 14:55

10 pro 2011, 21:11

Děkuji, nyní je jádro 2.6.38 a ani po nove instalaci Backtrack5 nejde žadný driver nainstalovat. Pomůže změna na Backtrack 4 nebo instalace Mandrivy?

Uživatelský avatar
Stealth
Level 5
Příspěvky: 127
Registrován: 18 bře 2009, 17:40

10 pro 2011, 22:24

Ako som písal vyššie Backtrack5 už ovládače pre Asus 167g obsahuje. Nieje potrebné inštalovať ďaľšie a ďaľšie ovládače. Jediné čo nemusí obsahovať je firmware pre Asus 167g resp. chipset rt73, ktory Asus 167g používa.
Ovládač a firmware sú dve odlišné veci. Je to robené takto kvôli tomu, že firmware je autorsky chránený kus kódu, ktorý nemá licencovanie GPL.

Naištaluj BackTrack5 a hneď po novej inštalácii zadaj príkaz "iwconfig"
Ak uvidíš iba text "no wireless extensions" existujú tri možnosti:
1. driver nieje nahratý (loadnutý)
2. driver existuje, ale chýba mu firmware
3. driver síce existuje, ale Asus 167g je nepodporované revízia hardware (zmenený Vendor)

Pre bod č.2 hľadaj pomocou google a slovíčok "Asus 167g" "firmware" postup ako ho nahrať do systému. Je možné, že postup bude aj v dokumentácii k ovládaču pre rt73, ktorý si sa pokúšal kompilovať a inštalovať. Čítaj README v tom balíku.
Pre bod č. 3 je lepšie prejsť na staršiu verziu BackTrack.

Ak nenájdeš v systéme driver s označením rt73 vyskúšaj rt2870. To je ovládač, ktorý slúži pre niekoľko rôznych wifi kariet od Ralinku. Líšia sa len iným rádio čipom (niektoré len b/g a niektoré a/b/g, alebo b/g/n) pričom host procesor je rovnaký.

Uživatelský avatar
Stealth
Level 5
Příspěvky: 127
Registrován: 18 bře 2009, 17:40

10 pro 2011, 22:58

Jo a ešte som zabudol. USB je zbernica tak ako napríklad PCI.
Je dobré preskúmať či vidíš to čo si strčil do USB na zbernici pomocou príkazu "lsusb".
Ak výpis obsahuje nejaké info o zariadení, ktoré chceš na USB používať, tak môžeš pokračovať v nahrávaní ovládačov, inak treba najskôr preskúmať prečo nieje vidieť na zbernici zariadenie, ktoré si tam strčil.
Ďaľšia vec je, že systémove ovládače sa volajú napr. rt73.pci, alebo rt2870.pci, takže nenahrávaj ovládač len ako rt73, alebo rt2870.

Uživatelský avatar
pswoboda
Level 1
Příspěvky: 22
Registrován: 08 pro 2011, 14:55

11 pro 2011, 11:34

Dík za podrobný postup a práci, jakou jsi s tím měl.
Nainstaloval jsem BT5 znovu na zformatovany disc a podle tvého postupu jsem se propracoval až sem:

root@bt:~# iwconfig
lo no wireless extensions.

eth0 no wireless extensions.

irda0 no wireless extensions.

wlan0 IEEE 802.11bg ESSID:off/any
Mode:Managed Access Point: Not-Associated Tx-Power=20 dBm
Retry long limit:7 RTS thr:off Fragment thr:off
Encryption key:off
Power Management:off

wlan1 unassociated Nickname:"rtl_wifi"
Mode:Auto Access Point: Not-Associated Sensitivity:0/0
Retry:off RTS thr:off Fragment thr:off
Encryption key:off
Power Management:off
Link Quality:0 Signal level:0 Noise level:0
Rx invalid nwid:0 Rx invalid crypt:0 Rx invalid frag:0
Tx excessive retries:0 Invalid misc:0 Missed beacon:0
---------------------------------------------------------------------

root@bt:~# lsusb
Bus 007 Device 002: ID 0458:008c KYE Systems Corp. (Mouse Systems)
Bus 007 Device 001: ID 1d6b:0001 Linux Foundation 1.1 root hub
Bus 006 Device 001: ID 1d6b:0001 Linux Foundation 1.1 root hub
Bus 005 Device 001: ID 1d6b:0001 Linux Foundation 1.1 root hub
Bus 004 Device 001: ID 1d6b:0001 Linux Foundation 1.1 root hub
Bus 003 Device 001: ID 1d6b:0001 Linux Foundation 1.1 root hub
Bus 002 Device 005: ID 0b05:1791 ASUSTek Computer, Inc.
Bus 002 Device 001: ID 1d6b:0002 Linux Foundation 2.0 root hub
Bus 001 Device 001: ID 1d6b:0002 Linux Foundation 2.0 root hub

------------------------------------------------------------------------------------

Asus tedy v USB je videt a jeste prikladam výtah z manualu k instalaci.:

Installation
===============================================================================
<<Method 1>>
Runing the scripts accomplish all operations including building up modules
from the source code, installing driver to the kernel and starting up the nic.
1. Build up the drivers from the source code
make

2. Install the driver to the kernel
make install
reboot

3. bring up wlan if nic is not brought up by GUI, such as NetworkManager
ifconfig wlan0 up
Note: use ifconfig to check whether wlan0 is brought up and use iwconfig to check your wlan interface name,
since it may change wlan0 to wlan1,etc.

<<Method 2>>
Or only load the driver module to kernel and start up nic.
1. Build up the drivers from the source code
make
2. Copy firmware to /lib/firmware/ or /lib/firmware/(KERNEL_VERSION)/
cp -rf firmware/RTL8192SU /lib/firmware
or
cp -rf firmware/RTL8192SU /lib/firmware/(KERNEL_VERSION)
Note: This depends on whether (KERNEL_VERSION) subdirectory exists under /lib/firmware

3. Load driver module to kernel and start up nic.
./wlan0up
Note: when "insmod: error inserting 'xxxx.ko': -1 File exists" comes out
after run ./wlan0up, please run ./wlan0down first, then it should
be ok..
Note: If you see the message of "unkown symbol" during ./wlan0up, it
is suggested to build driver by <<Method 1>>.


Z toho jsem vyčetl asi jen to, ze maám složku s firmware nakopírovat do /lib/firmware/ ale dále už tomu nerozumím.

Uživatelský avatar
Stealth
Level 5
Příspěvky: 127
Registrován: 18 bře 2009, 17:40

11 pro 2011, 17:18

No takže to vyzerá, že ovládač je už loadnutý akurát mu niečo chýba.
Inak tento USB Asus bude používať chipset Realtek a nie Ralink. Je pravdepodobné, že existuje Asus 167 vo verzii PCI, ktorý používa Ralink chipset. Skupina Serialmonkey robila ovládače len pre Ralink.
Preskúmaj či je firmware v adresári kde ho ovládač očakáva, pripadne prezri systémový log.
Ak chýba firmware, býva o tom hláška v logu. Ak v logu nič nenajdeš, čo by naznačovalo na chýbajúci firmware, je pravdepodobné, že karta nieje nakonfigurovaná.
Tých parametrov pre konfiguráciu je celkom aj dosť, tak buď to budeš vypisovať v konzole každý krát keď nahodíš systém, alebo si spravíš skript, ktorý odštartuješ po loadnutí systému.
Môžeš použiť help k príkazom zo systému, alebo použi google pre viac informácií ako sa konfiguruje wlan karta pomocou príkazov iwconfig, iwpriv, iwlist a ifconfig.
To, že sú tam akoby dve wlan karty môže byť tak, že wlan0 je virtuálny interface, ktorý sa normálne nepoužíva a nekonfiguruje. Konfiguruje a používa sa až ten ďaľší interface t.j. wlan1, preto je vo výpise vidieť aj viac informácií ako pre wlan0.

Uživatelský avatar
pswoboda
Level 1
Příspěvky: 22
Registrován: 08 pro 2011, 14:55

11 pro 2011, 19:27

Dík za vyčerpávající informace...V Linuxu jsme naprosty nováček a už věta:Preskúmaj či je firmware v adresári kde ho ovládač očakáva, pripadne prezri systémový log.-je pro mě zatím tajemstvím. Zkusím určitě hodně Googlovat a taky zkusím BT4, jestli se náhodou nechytne. Dík za všachna info

Uživatelský avatar
pswoboda
Level 1
Příspěvky: 22
Registrován: 08 pro 2011, 14:55

14 pro 2011, 22:48

Tak jsem systém přehrál na BT4 a výsledky mám zatím stejné. Ovladač jsem zkusil nahrát přez ndiswrapper a dostal jsem se při výpisu z airmo-ng zatím pouze sem.:

Found 2 processes that could cause trouble.
If airodump-ng, aireplay-ng or airtun-ng stops working after
a short period of time, you may want to kill (some of) them!

PID Name
1494 dhclient3
2125 dhclient3
Process with PID 2125 (dhclient3) is running on interface wlan0


Interface Chipset Driver

wlan1 Broadcom b43 - [phy0]
wlan0 Unknown ndiswrapper (MONITOR MODE NOT SUPPORTED)

na wlan0 už se nějaké zařízení zobrazuje, jen teď prosím poradit, jestli je chyba ve firware nebo ovladači. Děkuji za každý příspěvek

Uživatelský avatar
Stealth
Level 5
Příspěvky: 127
Registrován: 18 bře 2009, 17:40

15 pro 2011, 06:36

Môžeš prosím vysvetliť prečo nahrávaš pokaždým ovládače určené pre iný hardware?
Tvoja bezdrátova karta vo verzii USB je jednoznačne identifikovateľná poďla tých čísiel čo vypisuje príkaz lsusb.
Bus 002 Device 005: ID 0b05:1791 ASUSTek Computer, Inc.
Každé zariadenie má jednoznačný identifikátor (preukaz totožnosti) a v tojom prípade je to:ID 0b05:1791
Hľadaj na Intete tieto dva kódy a dostaneš sa k ovládačom presne pre toto zariadenie.
Môžeš skúsiť tu:
http://www.wireless-driver.com/asus-usb-n11-wireless-usb-driver-utility/

Uživatelský avatar
pswoboda
Level 1
Příspěvky: 22
Registrován: 08 pro 2011, 14:55

15 pro 2011, 09:33

Nemůžu nikde žádný ovladač nalézt. V tvém odkazu adaptér je, ale ovladače jsou jen pro win a Mac.

Uživatelský avatar
Stealth
Level 5
Příspěvky: 127
Registrován: 18 bře 2009, 17:40

15 pro 2011, 10:28

Tak buď mám ja nejaký iný Internet, alebo si špatne pozeral.
Ja tam vidím aj ovládač pre Linux...

ASUS USB_N11 driver for Linux, Support Linux Kernel up to 2.6.27

Existujú určite aj novšie ovládače, kukni priamo na stránky Ralinku.

Uživatelský avatar
pswoboda
Level 1
Příspěvky: 22
Registrován: 08 pro 2011, 14:55

15 pro 2011, 11:52

Internet máme stejný, jen tvůj odkaz je na ovladač k ID PID_0B05 VID_1761, ale já potřebuji 0805:1791

Uživatelský avatar
Stealth
Level 5
Příspěvky: 127
Registrován: 18 bře 2009, 17:40

15 pro 2011, 12:29

Ak nenájdeš iný ovládač, môžeš sa pokúsiť tie kódy do ovládača doplniť.
V prípade Linux ovládača je to dosť ľahká vec. Nájdeš ich v súbore rt2870.h
Po doplnení a kompilácii by mal ovládač fungovať, ovšem je to len pre jadrá do 2.6.27.

Uživatelský avatar
pswoboda
Level 1
Příspěvky: 22
Registrován: 08 pro 2011, 14:55

15 pro 2011, 23:24

Díky za rady, teď se k tomu dostanu až začátkem týdne, dám vědět

Uživatelský avatar
pswoboda
Level 1
Příspěvky: 22
Registrován: 08 pro 2011, 14:55

21 pro 2011, 20:46

Tak s tím zatím stále zápasím. Zkusil jsem nainstalovat Mandriva 2011 a tam je opravdu karta ihned detekovana, podařil se mi i nainstalovat aircrack-ng, ale uz se mi treba vůbec nedaří nainstalovat Gerix wifi cracker: Dá se pro aicrack nějak nahradit příkaz airmon-ng a nastartovat tak kartu nebo dohrat Gerix? sudo make nefunguje a instalace tak nejsíš jde jen s balíky .rpm, ale ten se mi nepodařilo nikde sosnout. D

Uživatelský avatar
Stealth
Level 5
Příspěvky: 127
Registrován: 18 bře 2009, 17:40

22 pro 2011, 08:40

Bohužiaľ nepoznám Gerix, ale ak by si stiahol ovládače priamo z Ralink webu a doplnil si do nich ten ID kód, tak by ti to fungovalo. Keď som písal, že sú tam aj novšie, tak som to myslel vážne, pretože ich mám stiahnuté. Prípadne môžeš ísť cestou compat-wireless, čo sa tu už preberalo niekoľko krát. Ak chceš niečo kompilovať, tak distro musí obsahovať zdrojáky jadra. Bez nich ovládače neskompiluješ.

Uživatelský avatar
pswoboda
Level 1
Příspěvky: 22
Registrován: 08 pro 2011, 14:55

22 pro 2011, 15:59

Díky, právě jsem sosnul soubor RT2870USB(RT2870/RT2770 přímo z Ralinku. Jestli je to ten spravný, jak do něj prosím doplním ID kod? Bude mi to fungovat v BT5 nebo BT4 ??? Děkuji.

Uživatelský avatar
Stealth
Level 5
Příspěvky: 127
Registrován: 18 bře 2009, 17:40

22 pro 2011, 18:48

Je možné, že ho máš ešte zabalený nejakým pakerom, ale inak ovládač by mal mať plný názov:
2010_0709_RT2870_Linux_STA_v2.4.0.1. Aspoň ja mám túto poslednú verziu. Neviem, nekontroloval som Ralink web minimálne 3 mesiace, možno je niečo novšie.
V tomto ovládači pohľadaj súbor rtusb_dev_id.c a kukni sa na neho text editorom. Myslím, že pochopíš ako to treba pridať. Môžeš to pridať za posledným Asus kódom, ktorý je na č.riadku 55. Doporučujem veľmi pozorne čítať pribalené *.txt súbory. Obsahujú veľmi dôležité informácie od kompilácie až po nastavenie parametrov.
Nezaručujem, že po pridaní ID to bude fungovať, ale je 99% šanca, že to bude funkčné. Nové ID môže znamenať tiež určité vnútorné zmeny, na ktorý nieje ovládač naprogramovaný.
Predpokladám, že minimálne v BT4 pôjde. V BT5 neviem. V kóde sa dá dočítať, že má podporu pre jadrá >=2.6.31, ovšem kukni na dátum kedy bol ovládač vydaný. Jadro sa poslednú dobu veľmi rýchlo mení. Ovládač pre rt2870 je prítomný aj v jadre (to je iný ako ten od Ralinku), ovšem ako som pozeral 2.6.39, tiež mu chýba tvoje ID.

Uživatelský avatar
pswoboda
Level 1
Příspěvky: 22
Registrován: 08 pro 2011, 14:55

22 pro 2011, 20:12

Jupííí, děkuji za každé vlakno. Ovladač mám s ůplně stejným označením a s jeho rozbalením ani editací problém mít nebudu, na to už jsem se teď podíval. Zkusím se vrátit k BT4 a znovu zápasit se zavedenim driveru, ale jelikož musím ráno zase vstávat do práce, vysledek napišu zase ihned, jak mě Ježíšek propustí a děkuji za každou větu, která mě požene dále. VŠEM HEZKÉ VÁNOCE a zdravíčko do NY2012 a zvlášť Mr.Stealth za jeho trpělivost

Uživatelský avatar
pswoboda
Level 1
Příspěvky: 22
Registrován: 08 pro 2011, 14:55

11 led 2012, 00:02

Tak jsem tyden zkousel zprovoznit ovladace na Asus wl 167g, ale vysledky se nedostavily, tak jsem druhy tyden zkousel v Mandrive 2011, kde ovladace funguji, nejak doinstalovat aircrack-ng a gerix wifi cracker, ale ani jeden program se mi nepodarilo zprovoznit. Karta asi poleti do kose!!! Poradi prosim nekdo, jakou koupit jinou kartu, kterou Bactrack 4 nebo 5 sam detekuje a bude umet injection?

Uživatelský avatar
Natch
Příspěvky: 2
Registrován: 20 pro 2011, 16:36

11 led 2012, 09:34

U mě pomohlo k rozchození wi-fi usb instalace ovladačů podle tohohle návodu.
http://raffaele.backbox.org/content/how-install-compat-wireless-aircrack-patches

Uživatelský avatar
pswoboda
Level 1
Příspěvky: 22
Registrován: 08 pro 2011, 14:55

11 led 2012, 10:32

Dik za odkaz, zkusim se s tim zabyvat

Uživatelský avatar
Stealth
Level 5
Příspěvky: 127
Registrován: 18 bře 2009, 17:40

11 led 2012, 19:38

Môžeš postnúť chybové hlášky z "výsledky se nedostavily" ?
Predpokladám, že si mal problém s kompiláciou.

Uživatelský avatar
pswoboda
Level 1
Příspěvky: 22
Registrován: 08 pro 2011, 14:55

12 led 2012, 08:49

Ahoj, ja ted jedu na Mandrive, kde se mi podaril nainstalovat Aicrack-ng, tak chybove hlasky ted nemohu nakopirovat, tak az se snad nekdy k Backtrack vratim, tak to sem hodim. Jeste bych chtel dostat do Mandrivy Gerix wifi cracker, pomuze nekdo s nejakym odkazem? Dekuji

Odpovědět
  • Podobná témata
    Odpovědi
    Zobrazení
    Poslední příspěvek
  • Informace
  • Kdo je online

    Uživatelé prohlížející si toto fórum: Žádní registrovaní uživatelé a 1 host